Target
Chromatin remodeling regulator CECR2
Ligand
BDBM50269685
Substrate
Meas. Tech.
ChEMBL_1707032 (CHEMBL4058265)
IC50
190±n/a nM
Citation
 Crawford, TDAudia, JEBellon, SBurdick, DJBommi-Reddy, ACôté, ACummings, RTDuplessis, MFlynn, EMHewitt, MHuang, HRJayaram, HJiang, YJoshi, SKiefer, JRMurray, JNasveschuk, CGNeiss, APardo, ERomero, FASandy, PSims, RJTang, YTaylor, AMTsui, VWang, JWang, SWang, YXu, ZZawadzke, LZhu, XAlbrecht, BKMagnuson, SRCochran, AG GNE-886: A Potent and Selective Inhibitor of the Cat Eye Syndrome Chromosome Region Candidate 2 Bromodomain (CECR2). ACS Med Chem Lett 8:737-741 (2017)  
Target
Name:
Chromatin remodeling regulator CECR2
Synonyms:
CECR2 Cat eye syndrome critical region protein 2 | KIAA1740
Type:
PROTEIN
Mol. Mass.:
164223.89
Organism:
Homo sapiens (Human)
Description:
ChEMBL_107999
Residue:
1484
  
Inhibitor
Name:
BDBM50269685
Synonyms:
CHEMBL4077529
Type:
Small organic molecule
Emp. Form.:
C26H32N4O2
Mol. Mass.:
432.5579
SMILES:
C[C@H](N1CCC(CC1)N(C)C(=O)c1cn(CC=C)c(=O)c2[nH]c(C)cc12)c1ccccc1
: