Target
Mu-type opioid receptor
Ligand
BDBM50013936
Substrate
Meas. Tech.
ChEMBL_148837 (CHEMBL753955)
Ki
4.20±n/a nM
Citation
 Lalinde, NMoliterni, JWright, DSpencer, HKOssipov, MHSpaulding, TCRudo, FG Synthesis and pharmacological evaluation of a series of new 3-methyl-1,4-disubstituted-piperidine analgesics. J Med Chem 33:2876-82 (1990)  
Target
Name:
Mu-type opioid receptor
Synonyms:
MOR-1 Mu-type opioid receptor (MOR) OPRM_RAT Opioid receptor B Ror-b
Type:
G Protein-Coupled Receptor (GPCR)
Mol. Mass.:
44503.11
Organism:
Rattus norvegicus (rat)
Description:
Competition binding assays were carried out using membrane preparations from transfected HN9.10 cells that constitutively expressed the mu opioid receptor.
Residue:
398
  
Inhibitor
Name:
BDBM50013936
Synonyms:
2-Methoxy-N-(3-methyl-1-phenethyl-piperidin-4-yl)-N-phenyl-propionamide | CHEMBL100111
Type:
Small organic molecule
Emp. Form.:
C24H32N2O2
Mol. Mass.:
380.5231
SMILES:
COC(C)C(=O)N(C1CCN(CCc2ccccc2)CC1C)c1ccccc1
: