Target
CREB-binding protein/Histone acetyltransferase p300
Ligand
BDBM50286461
Substrate
Meas. Tech.
ChEMBL_1729041 (CHEMBL4144319)
IC50
47±n/a nM
Citation
 Michaelides, MRKluge, APatane, MVan Drie, JHWang, CHansen, TMRisi, RMMantei, RHertel, CKarukurichi, KNesterov, AMcElligott, Dde Vries, PLangston, JWCole, PAMarmorstein, RLiu, HLasko, LBromberg, KDLai, AKesicki, EA Discovery of Spiro Oxazolidinediones as Selective, Orally Bioavailable Inhibitors of p300/CBP Histone Acetyltransferases. ACS Med Chem Lett 9:28-33 (2018)  
Target
Name:
CREB-binding protein/Histone acetyltransferase p300
Synonyms:
Type:
Mol. Mass.:
Description:
ASSAY_ID of ChEMBL is 2168996
Components:
This complex has 2 components.
Component 1
Name:
Histone acetyltransferase p300
Synonyms:
EP300 HIF1A/p300/CREB-binding protein P300
Type:
Protein
Mol. Mass.:
264223.04
Organism:
Homo sapiens (Human)
Description:
Q09472
Residue:
2414
  
Component 2
Name:
CREB-binding protein
Synonyms:
CBP CREB-binding protein (CBP) CREBBP
Type:
Transcription Coactivator
Mol. Mass.:
265411.66
Organism:
Homo sapiens (Human)
Description:
Q92793
Residue:
2442
  
Inhibitor
Name:
BDBM50286461
Synonyms:
CHEMBL4166626
Type:
Small organic molecule
Emp. Form.:
C27H30N4O5
Mol. Mass.:
490.5509
SMILES:
CNC(=O)Nc1ccc2c(CC[C@@]22OC(=O)N(CC(=O)N(Cc3ccccc3)[C@@H](C)C3CC3)C2=O)c1
: