Target
Cysteinyl leukotriene receptor 1
Ligand
BDBM50016687
Substrate
Meas. Tech.
ChEBML_70842
Ki
100000±n/a nM
Citation
 Huang, FCShoupe, TSLin, CJLee, TDChan, WKTan, JSchnapper, MSuh, JTGordon, RJSonnino, PA Differential effects of a series of hydroxamic acid derivatives on 5-lipoxygenase and cyclooxygenase from neutrophils and 12-lipoxygenase from platelets and their in vivo effects on inflammation and anaphylaxis. J Med Chem 32:1836-42 (1989)  
Target
Name:
Cysteinyl leukotriene receptor 1
Synonyms:
CLTR1_CAVPO | CYSLTR1
Type:
Enzyme Catalytic Domain
Mol. Mass.:
39007.58
Organism:
GUINEA PIG
Description:
Leukotriene D4 0 GUINEA PIG::Q2NNR5
Residue:
340
  
Inhibitor
Name:
BDBM50016687
Synonyms:
2-(4-Benzyloxy-phenyl)-N-hydroxy-N-methyl-acetamide | CHEMBL54453
Type:
Small organic molecule
Emp. Form.:
C16H17NO3
Mol. Mass.:
271.3111
SMILES:
CN(O)C(=O)Cc1ccc(OCc2ccccc2)cc1
: