Target
Vasopressin V2 receptor
Ligand
BDBM50016750
Substrate
Meas. Tech.
ChEMBL_214867 (CHEMBL820053)
Ki
11±n/a nM
Citation
 Callahan, JFAshton-Shue, DBryan, HGBryan, WMHeckman, GDKinter, LBMcDonald, JEMoore, MLSchmidt, DBSilvestri, JS Structure-activity relationships of novel vasopressin antagonists containing C-terminal diaminoalkanes and (aminoalkyl)guanidines. J Med Chem 32:391-6 (1989)  
Target
Name:
Vasopressin V2 receptor
Synonyms:
AVPR2 | V2R_PIG
Type:
PROTEIN
Mol. Mass.:
40556.17
Organism:
Sus scrofa
Description:
ChEMBL_214870
Residue:
370
  
Inhibitor
Name:
BDBM50016750
Synonyms:
1-[20-Benzyl-14-carbamoylmethyl-23-(4-ethoxy-benzyl)-17-isopropyl-13,16,19,22,25-pentaoxo-7,9-dithia-12,15,18,21,24-pentaaza-spiro[5.20]hexacosane-11-carbonyl]-pyrrolidine-2-carboxylic acid 3-aminomethyl-benzylamide | CHEMBL412732
Type:
Small organic molecule
Emp. Form.:
C54H73N9O9S2
Mol. Mass.:
1056.342
SMILES:
CCOc1ccc(C[C@H]2NC(=O)CC3(CCCCC3)SCSC[C@@H](NC(=O)[C@@H](CC(N)=O)NC(=O)[C@@H](NC(=O)[C@@H](Cc3ccccc3)NC2=O)C(C)C)C(=O)N2CCCC2C(=O)NCc2cccc(CN)c2)cc1
: