Target
Mitogen-activated protein kinase kinase kinase 14
Ligand
BDBM50457314
Substrate
Meas. Tech.
ChEMBL_1759315 (CHEMBL4194323)
IC50
21±n/a nM
Citation
 Kargbo, RB New Substituted Cyanoindoline Derivatives as MAP3K14 Kinase Inhibitors for the Treatment of Cancer and Autoimmune Disorders. ACS Med Chem Lett 8:908-910 (2017)  
Target
Name:
Mitogen-activated protein kinase kinase kinase 14
Synonyms:
HsNIK MAP3K14 NF-kappa-beta-inducing kinase (NF-kB) Serine/threonine-protein kinase NIK
Type:
Protein
Mol. Mass.:
104059.50
Organism:
Homo sapiens (Human)
Description:
Q99558
Residue:
947
  
Inhibitor
Name:
BDBM50457314
Synonyms:
CHEMBL4211990
Type:
Small organic molecule
Emp. Form.:
C27H26FN7O2
Mol. Mass.:
499.5394
SMILES:
CN1CC(F)C(C1)Oc1ccc(cc1Nc1nccc(n1)-c1cc2c(NC[C@]2(C)CO)c(c1)C#N)C#N
: