Target
Aminopeptidase N
Ligand
BDBM50131276
Substrate
Meas. Tech.
ChEMBL_1759818 (CHEMBL4194826)
IC50
28±n/a nM
Citation
 Amin, SAAdhikari, NJha, T Design of Aminopeptidase N Inhibitors as Anti-cancer Agents. J Med Chem 61:6468-6490 (2018)  
Target
Name:
Aminopeptidase N
Synonyms:
AMPN_PIG AP-M Alanyl aminopeptidase Aminopeptidase N (APN) Microsomal aminopeptidase pAPN
Type:
Protein
Mol. Mass.:
108810.25
Organism:
Sus scrofa (Pig)
Description:
P15145
Residue:
963
  
Inhibitor
Name:
BDBM50131276
Synonyms:
CHEMBL328470 | N-(3-{4-[3-(7-Chloro-quinolin-4-ylamino)-propyl]-piperazin-1-yl}-propyl)-N'-hydroxy-N-isobutyl-malonamide
Type:
Small organic molecule
Emp. Form.:
C26H39ClN6O3
Mol. Mass.:
519.079
SMILES:
CC(C)CN(CCCN1CCN(CCCNc2ccnc3cc(Cl)ccc23)CC1)C(=O)CC(=O)NO
: