Target
Dihydrofolate reductase
Ligand
BDBM50023681
Substrate
Meas. Tech.
ChEBML_217876
Ki
0.002±n/a nM
Citation
 Su, TLHuang, JTChou, TCOtter, GMSirotnak, FMWatanabe, KA Chemical synthesis and biological activities of 5-deazaaminopterin analogues bearing substituent(s) at the 5- and/or 7-position(s). J Med Chem 31:1209-15 (1988)  
Target
Name:
Dihydrofolate reductase
Synonyms:
DYR_MOUSE | Dhfr
Type:
Enzyme
Mol. Mass.:
21608.82
Organism:
Mus musculus (Mouse)
Description:
Residue:
187
  
Inhibitor
Name:
BDBM50023681
Synonyms:
2-{4-[(2,4-Diamino-5,7-dimethyl-pyrido[2,3-d]pyrimidin-6-ylmethyl)-amino]-benzoylamino}-pentanedioic acid | CHEMBL283138
Type:
Small organic molecule
Emp. Form.:
C22H25N7O5
Mol. Mass.:
467.4778
SMILES:
Cc1nc2nc(N)nc(N)c2c(C)c1CNc1ccc(cc1)C(=O)NC(CCC(O)=O)C(O)=O
: