Target
Pancreatic alpha-amylase
Ligand
BDBM50464427
Substrate
Meas. Tech.
ChEMBL_1780513 (CHEMBL4252030)
IC50
2348±n/a nM
Citation
 Taha, MIrshad, MImran, SChigurupati, SSelvaraj, MRahim, FIsmail, NHNawaz, FKhan, KM Synthesis of piperazine sulfonamide analogs as diabetic-II inhibitors and their molecular docking study. Eur J Med Chem 141:530-537 (2017)  
Target
Name:
Pancreatic alpha-amylase
Synonyms:
1,4-alpha-D-glucan glucanohydrolase AMYP_PIG Pancreatic α-amylase
Type:
Protein
Mol. Mass.:
57088.07
Organism:
Sus scrofa (Pig)
Description:
P00690
Residue:
511
  
Inhibitor
Name:
BDBM50464427
Synonyms:
CHEMBL4292777
Type:
Small organic molecule
Emp. Form.:
C18H21ClN2O2S
Mol. Mass.:
364.89
SMILES:
Cc1ccc(CN2CCN(CC2)S(=O)(=O)c2ccc(Cl)cc2)cc1
: