Target
Bromodomain-containing protein 4
Ligand
BDBM50466254
Substrate
Meas. Tech.
ChEMBL_1792708 (CHEMBL4264627)
Kd
44±n/a nM
Citation
 Yang, SMUrban, DJYoshioka, MStrovel, JWFletcher, SWang, AQXu, XShah, PHu, XHall, MDJadhav, AMaloney, DJ Discovery and lead identification of quinazoline-based BRD4 inhibitors. Bioorg Med Chem Lett 28:3483-3488 (2018)  
Target
Name:
Bromodomain-containing protein 4
Synonyms:
BRD4 Bromodomain-containing protein 4 (BRD4) Protein HUNK1
Type:
Protein
Mol. Mass.:
152264.84
Organism:
Homo sapiens (Human)
Description:
O60885
Residue:
1362
  
Inhibitor
Name:
BDBM50466254
Synonyms:
CHEMBL4288569
Type:
Small organic molecule
Emp. Form.:
C29H34ClN7O
Mol. Mass.:
532.08
SMILES:
CN(C)CCN1CCN(CC1)c1nc(NCc2cccc(Cl)c2)c2cc(ccc2n1)-c1ccc(=O)n(C)c1
: