Target
Beta-lactamase
Ligand
BDBM50033685
Substrate
Meas. Tech.
ChEMBL_40542 (CHEMBL652172)
IC50
>20000±n/a nM
Citation
 Buynak, JDWu, KBachmann, BKhasnis, DHua, LNguyen, HKCarver, CL Synthesis and biological activity of 7-alkylidenecephems. J Med Chem 38:1022-34 (1995)  
Target
Name:
Beta-lactamase
Synonyms:
AMPC_ENTCL | ampC
Type:
PROTEIN
Mol. Mass.:
41306.67
Organism:
Enterobacter cloacae
Description:
ChEMBL_40258
Residue:
381
  
Inhibitor
Name:
BDBM50033685
Synonyms:
CHEMBL8290 | Sodium; (2R,5R)-3-[2-hydroxy-eth-(Z)-ylidene]-7-oxo-4-oxa-1-aza-bicyclo[3.2.0]heptane-2-carboxylate
Type:
Small organic molecule
Emp. Form.:
C8H8NO5
Mol. Mass.:
198.1534
SMILES:
OC\C=C1/O[C@@H]2CC(=O)N2[C@H]1C([O-])=O
: