Target
Mu-type opioid/Nociceptin receptor
Ligand
BDBM50492403
Substrate
Meas. Tech.
ChEMBL_971895 (CHEMBL2405345)
EC50
1660±n/a nM
Citation
 Zamfirova, RPavlov, NTodorov, PMateeva, PMartinez, JCalmès, MNaydenova, E Synthesis and changes in affinity for NOP and opioid receptors of novel hexapeptides containing ?(2)-tryptophan analogues. Bioorg Med Chem Lett 23:4052-5 (2013)  
Target
Name:
Mu-type opioid/Nociceptin receptor
Synonyms:
Nociceptin/mu opioid receptor
Type:
Mol. Mass.:
Description:
ASSAY_ID of ChEMBL is 971895
Components:
This complex has 2 components.
Component 1
Name:
Mu-type opioid receptor
Synonyms:
MOR-1 Mu-type opioid receptor (MOR) OPRM_RAT Opioid receptor B Ror-b
Type:
G Protein-Coupled Receptor (GPCR)
Mol. Mass.:
44503.11
Organism:
Rattus norvegicus (rat)
Description:
Competition binding assays were carried out using membrane preparations from transfected HN9.10 cells that constitutively expressed the mu opioid receptor.
Residue:
398
  
Component 2
Name:
Nociceptin receptor
Synonyms:
Nociceptin/Orphanin FQ, NOP receptor OPRX_RAT Oprl | Oprl1
Type:
Enzyme Catalytic Domain
Mol. Mass.:
40531.08
Organism:
RAT
Description:
Nociceptin/Orphanin FQ, NOP receptor 0 RAT::P35370
Residue:
367
  
Inhibitor
Name:
BDBM50492403
Synonyms:
CHEMBL2403213
Type:
Small organic molecule
Emp. Form.:
C45H68N12O8S2
Mol. Mass.:
969.227
SMILES:
COc1ccc2[nH]cc([C@H](CNC(=O)[C@H](CCSC)NC(=O)[C@H](Cc3ccccc3)NC(=O)[C@H](CCCNC(N)=N)NC(C)=O)C(=O)N[C@@H](CCSC)C(=O)N[C@@H](CCCCN)C(N)=O)c2c1
: