Target
Squalene synthase
Ligand
BDBM50038091
Substrate
Meas. Tech.
ChEMBL_202115 (CHEMBL808973)
IC50
0.19±n/a nM
Citation
 Ponpipom, MMGirotra, NNBugianesi, RLRoberts, CDBerger, GDBurk, RMMarquis, RWParsons, WHBartizal, KFBergstom, JD Structure-activity relationships of C1 and C6 side chains of zaragozic acid A derivatives. J Med Chem 37:4031-51 (1994)  
Target
Name:
Squalene synthase
Synonyms:
FDFT_RAT Farnesyl-diphosphate farnesyltransferase SQS Squalene synthetase
Type:
PROTEIN
Mol. Mass.:
48109.41
Organism:
Rattus norvegicus
Description:
ChEMBL_1336736
Residue:
416
  
Inhibitor
Name:
BDBM50038091
Synonyms:
(6R,7R)-1-((4S,5R)-4-Acetoxy-5-methyl-3-methylene-6-phenyl-hexyl)-6-((4R,6S)-4,6-dimethyl-octanoyloxy)-4,7-dihydroxy-2,8-dioxa-bicyclo[3.2.1]octane-3,4,5-tricarboxylic acid | CHEMBL337256
Type:
Small organic molecule
Emp. Form.:
C35H48O14
Mol. Mass.:
692.7472
SMILES:
CC[C@H](C)C[C@H](C)CCC(=O)O[C@@H]1[C@@H](O)C2(CCC(=C)[C@@H](OC(C)=O)[C@H](C)Cc3ccccc3)OC1(C(O)=O)C(O)(C(O2)C(O)=O)C(O)=O
: