Target
3',5'-cyclic-AMP phosphodiesterase
Ligand
BDBM50041828
Substrate
Meas. Tech.
ChEMBL_157209 (CHEMBL768860)
IC50
190±n/a nM
Citation
 Ashton, MJCook, DCFenton, GKarlsson, JAPalfreyman, MNRaeburn, DRatcliffe, AJSouness, JEThurairatnam, SVicker, N Selective type IV phosphodiesterase inhibitors as antiasthmatic agents. The syntheses and biological activities of 3-(cyclopentyloxy)-4-methoxybenzamides and analogues. J Med Chem 37:1696-703 (1994)  
Target
Name:
3',5'-cyclic-AMP phosphodiesterase
Synonyms:
Phosphodiesterase 4A
Type:
PROTEIN
Mol. Mass.:
13615.65
Organism:
Sus scrofa
Description:
ChEMBL_155848
Residue:
118
  
Inhibitor
Name:
BDBM50041828
Synonyms:
CHEMBL289190 | N-(2-Chloro-phenyl)-3-cyclopentyloxy-4-methoxy-benzamide
Type:
Small organic molecule
Emp. Form.:
C19H20ClNO3
Mol. Mass.:
345.82
SMILES:
COc1ccc(cc1OC1CCCC1)C(=O)Nc1ccccc1Cl
: