Target
Chromatin remodeling regulator CECR2
Ligand
BDBM50495428
Substrate
Meas. Tech.
ChEMBL_1287023 (CHEMBL3111334)
IC50
501±n/a nM
Citation
 Fedorov, OLingard, HWells, CMonteiro, OPPicaud, SKeates, TYapp, CPhilpott, MMartin, SJFelletar, IMarsden, BDFilippakopoulos, PMüller, SKnapp, SBrennan, PE [1,2,4]triazolo[4,3-a]phthalazines: inhibitors of diverse bromodomains. J Med Chem 57:462-76 (2014)  
Target
Name:
Chromatin remodeling regulator CECR2
Synonyms:
CECR2 Cat eye syndrome critical region protein 2 | KIAA1740
Type:
PROTEIN
Mol. Mass.:
164223.89
Organism:
Homo sapiens (Human)
Description:
ChEMBL_107999
Residue:
1484
  
Inhibitor
Name:
BDBM50495428
Synonyms:
CHEMBL3110357
Type:
Small organic molecule
Emp. Form.:
C18H17N5O2S
Mol. Mass.:
367.425
SMILES:
Cc1nnc2c3ccccc3c(nn12)-c1ccc(C)c(NS(C)(=O)=O)c1
: