Target
Prolyl endopeptidase
Ligand
BDBM50051544
Substrate
Meas. Tech.
ChEMBL_158381 (CHEMBL769582)
IC50
2.7±n/a nM
Citation
 Portevin, BBenoist, ARémond, GHervé, YVincent, MLepagnol, JDe Nanteuil, G New prolyl endopeptidase inhibitors: in vitro and in vivo activities of azabicyclo[2.2.2]octane, azabicyclo[2.2.1]heptane, and perhydroindole derivatives. J Med Chem 39:2379-91 (1996)  
Target
Name:
Prolyl endopeptidase
Synonyms:
PPCE_RAT | Prep
Type:
PROTEIN
Mol. Mass.:
80731.99
Organism:
Rattus norvegicus
Description:
ChEMBL_1336163
Residue:
710
  
Inhibitor
Name:
BDBM50051544
Synonyms:
CHEMBL311848 | [(2S,3aS,7aS)-2-(2,3-Dihydro-pyrrole-1-carbonyl)-octahydro-indol-1-yl]-((1R,2S)-2-phenyl-cyclopropyl)-methanone
Type:
Small organic molecule
Emp. Form.:
C23H28N2O2
Mol. Mass.:
364.4806
SMILES:
O=C([C@@H]1C[C@@H]1c1ccccc1)N1[C@H]2CCCC[C@H]2C[C@H]1C(=O)N1CCC=C1
: