Target
Substance-K receptor
Ligand
BDBM50052517
Substrate
Meas. Tech.
ChEMBL_209225 (CHEMBL814853)
EC50
>50000±n/a nM
Citation
 Byk, GHalle, DZeltser, IBitan, GSelinger, ZGilon, C Synthesis and biological activity of NK-1 selective, N-backbone cyclic analogs of the C-terminal hexapeptide of substance P. J Med Chem 39:3174-8 (1996)  
Target
Name:
Substance-K receptor
Synonyms:
NK-2 receptor NK2R_RAT Neurokinin A receptor SKR Tac2r Tacr2
Type:
Enzyme Catalytic Domain
Mol. Mass.:
43868.63
Organism:
Rattus norvegicus (Rat)
Description:
Neurokinin NK2 TACR2 Murine::P16610
Residue:
390
  
Inhibitor
Name:
BDBM50052517
Synonyms:
(S)-2-{2-[(6S,9R,12S)-6,9-Dibenzyl-12-(3-guanidino-propyl)-5,8,11,14,17,20-hexaoxo-1,4,7,10,13,16hexaaza-cycloicos-4-yl]-acetylamino}-4-methyl-pentanoic acid ((S)-1-carbamoyl-3-methylsulfanyl-propyl)-amide | CHEMBL319473
Type:
Small organic molecule
Emp. Form.:
C45H66N12O9S
Mol. Mass.:
951.146
SMILES:
CSCC[C@H](NC(=O)[C@H](CC(C)C)NC(=O)CN1CCNC(=O)CCC(=O)NCC(=O)N[C@@H](CCCNC(N)=N)C(=O)N[C@H](Cc2ccccc2)C(=O)N[C@@H](Cc2ccccc2)C1=O)C(N)=O
: