Target
Glutaminase kidney isoform, mitochondrial
Ligand
BDBM278481
Substrate
Meas. Tech.
ChEMBL_1809975 (CHEMBL4309435)
IC50
3800±n/a nM
Citation
 Zimmermann, SCDuvall, BTsukamoto, T Recent Progress in the Discovery of Allosteric Inhibitors of Kidney-Type Glutaminase. J Med Chem 62:46-59 (2019)  
Target
Name:
Glutaminase kidney isoform, mitochondrial
Synonyms:
GLS GLSK_HUMAN K-glutaminase L-glutamine amidohydrolase
Type:
Protein
Mol. Mass.:
73471.89
Organism:
Homo sapiens (Human)
Description:
O94925
Residue:
669
  
Inhibitor
Name:
BDBM278481
Synonyms:
(2R)-2-(dimethylamino)-2-(4-methoxyphenyl)-N- | US10040789, Example 15
Type:
Small organic molecule
Emp. Form.:
C21H26N8O2S
Mol. Mass.:
454.549
SMILES:
COc1ccc(cc1)[C@@H](N(C)C)C(=O)Nc1nnc(N[C@@H]2CCN(C2)c2cccnn2)s1
: