Target
Glutaminase kidney isoform, mitochondrial
Ligand
BDBM278401
Substrate
Meas. Tech.
ChEMBL_1809975 (CHEMBL4309435)
IC50
150±n/a nM
Citation
 Zimmermann, SCDuvall, BTsukamoto, T Recent Progress in the Discovery of Allosteric Inhibitors of Kidney-Type Glutaminase. J Med Chem 62:46-59 (2019)  
Target
Name:
Glutaminase kidney isoform, mitochondrial
Synonyms:
GLS GLSK_HUMAN K-glutaminase L-glutamine amidohydrolase
Type:
Protein
Mol. Mass.:
73471.89
Organism:
Homo sapiens (Human)
Description:
O94925
Residue:
669
  
Inhibitor
Name:
BDBM278401
Synonyms:
(2R)-2-Methoxy-2-phenyl-N-[5-[[(3R)-1-pyridazin-3-ylpyrrolidin-3-yl]amino]-1,3,4-thiadiazol-2-yl]acetamide US10294221, Example 20(a)
Type:
Small organic molecule
Emp. Form.:
C19H21N7O2S
Mol. Mass.:
411.481
SMILES:
CO[C@@H](C(=O)Nc1nnc(N[C@@H]2CCN(C2)c2cccnn2)s1)c1ccccc1
: