Target
Adenosine receptor A3
Ligand
BDBM50059414
Substrate
Meas. Tech.
ChEMBL_32001 (CHEMBL646598)
Ki
2.7±n/a nM
Citation
 Jiang, Jvan Rhee, AMChang, LPatchornik, AJi, XDEvans, PMelman, NJacobson, KA Structure-activity relationships of 4-(phenylethynyl)-6-phenyl-1,4-dihydropyridines as highly selective A3 adenosine receptor antagonists. J Med Chem 40:2596-608 (1997)  
Target
Name:
Adenosine receptor A3
Synonyms:
A3 adenosine receptor (hA3) ADORA3 | Adenosine A3 receptor (A3AR)
Type:
G Protein-Coupled Receptor (GPCR)
Mol. Mass.:
36197.32
Organism:
Homo sapiens (Human)
Description:
P0DMS8
Residue:
318
  
Inhibitor
Name:
BDBM50059414
Synonyms:
2-Methyl-6-phenyl-4-phenylethynyl-1,4-dihydro-pyridine-3,5-dicarboxylic acid 3-ethyl ester 5-(4-nitro-benzyl) ester | CHEMBL265096
Type:
Small organic molecule
Emp. Form.:
C31H24N2O6
Mol. Mass.:
520.5321
SMILES:
CCOC(=O)c1c(C)nc(-c2ccccc2)c(C(=O)OCc2ccc(cc2)[N+]([O-])=O)c1C#Cc1ccccc1
: