Target
5-lipoxygenase
Ligand
BDBM24777
Substrate
Meas. Tech.
ChEMBL_157766 (CHEMBL767669)
IC50
17000±n/a nM
Citation
 Müller, KPrinz, HGawlik, IZiereis, KHuang, HS Simple analogues of anthralin: unusual specificity of structure and antiproliferative activity. J Med Chem 40:3773-80 (1997)  
Target
Name:
5-lipoxygenase
Synonyms:
Arachidonate 5-lipoxygenase
Type:
PROTEIN
Mol. Mass.:
49994.23
Organism:
Bos taurus
Description:
ChEMBL_157766
Residue:
430
  
Inhibitor
Name:
BDBM24777
Synonyms:
5-hydroxy-1,4-dihydronaphthalene-1,4-dione CHEMBL43612 Juglone (6a)
Type:
Small organic molecule
Emp. Form.:
C10H6O3
Mol. Mass.:
174.1528
SMILES:
Oc1cccc2C(=O)C=CC(=O)c12
: