Target
Integrin alpha-IIb/beta-3
Ligand
BDBM50061848
Substrate
Meas. Tech.
ChEMBL_70319 (CHEMBL678024)
IC50
20±n/a nM
Citation
 Su, TNaughton, MASmyth, MSRose, JWArfsten, AEMcCowan, JRJakubowski, JAWyss, VLRuterbories, KJSall, DJScarborough, RM Fibrinogen receptor (GPIIb-IIIa) antagonists derived from 5,6-bicyclic templates. Amidinoindoles, amidinoindazoles, and amidinobenzofurans containing the N-alpha-sulfonamide carboxylic acid function as potent platelet aggregation inhibitors. J Med Chem 40:4308-18 (1998)  
Target
Name:
Integrin alpha-IIb/beta-3
Synonyms:
Glycoprotein IIb/IIIa
Type:
Mol. Mass.:
Description:
ASSAY_ID of EBI is 30109
Components:
This complex has 2 components.
Component 1
Name:
Integrin beta-3
Synonyms:
CD_antigen=CD61 GPIIIa ITGB3 Platelet membrane glycoprotein IIIa
Type:
Protein
Mol. Mass.:
87038.91
Organism:
Homo sapiens (Human)
Description:
P05106
Residue:
788
  
Component 2
Name:
Integrin alpha-IIb
Synonyms:
CD_antigen=CD41 GPIIb Glycoprotein IIb ITGA2B Integrin alpha-IIb heavy chain Integrin alpha-IIb light chain, form 2 Integrin alpha-V/beta-3 and alpha-IIb/beta 3 | Platelet membrane glycoprotein IIb
Type:
Protein
Mol. Mass.:
113354.85
Organism:
Homo sapiens (Human)
Description:
P08514
Residue:
1039
  
Inhibitor
Name:
BDBM50061848
Synonyms:
3-{3-[(5-Carbamimidoyl-1H-indole-2-carbonyl)-methyl-amino]-propionylamino}-3-phenyl-propionic acid | CHEMBL344917
Type:
Small organic molecule
Emp. Form.:
C23H25N5O4
Mol. Mass.:
435.4757
SMILES:
CN(CCC(=O)NC(CC(O)=O)c1ccccc1)C(=O)c1cc2cc(ccc2[nH]1)C(N)=N
: