Target
Phosphodiesterase
Ligand
BDBM50061903
Substrate
Meas. Tech.
ChEMBL_156453 (CHEMBL764831)
IC50
42000±n/a nM
Citation
 Xia, YChackalamannil, SCzarniecki, MTsai, HVaccaro, HCleven, RCook, JFawzi, AWatkins, RZhang, H Synthesis and evaluation of polycyclic pyrazolo[3,4-d]pyrimidines as PDE1 and PDE5 cGMP phosphodiesterase inhibitors. J Med Chem 40:4372-7 (1998)  
Target
Name:
Phosphodiesterase
Synonyms:
Heart phosphodiesterase | Phosphodiesterase 3B
Type:
PROTEIN
Mol. Mass.:
124301.20
Organism:
Bos taurus
Description:
ChEMBL_156453
Residue:
1115
  
Inhibitor
Name:
BDBM50061903
Synonyms:
3-Benzyl-2,5,7,7-tetramethyl-7,8-dihydro-2H,5H-1,2,5,6,8a-pentaaza-as-indacen-4-one | CHEMBL137712
Type:
Small organic molecule
Emp. Form.:
C18H21N5O
Mol. Mass.:
323.3922
SMILES:
CN1C2=NC(C)(C)CN2c2nn(C)c(Cc3ccccc3)c2C1=O
: