Target
Peptidyl-prolyl cis-trans isomerase FKBP1A
Ligand
BDBM50064353
Substrate
Meas. Tech.
ChEMBL_66271 (CHEMBL678141)
IC50
4±n/a nM
Citation
 Wagner, RRhoades, TAOr, YSLane, BCHsieh, GMollison, KWLuly, JR 32-Ascomycinyloxyacetic acid derived immunosuppressants. Independence of immunophilin binding and immunosuppressive potency. J Med Chem 41:1764-76 (1998)  
Target
Name:
Peptidyl-prolyl cis-trans isomerase FKBP1A
Synonyms:
12 kDa FK506-binding protein FK506-binding protein 1A FKB1A_HUMAN FKBP-1A FKBP12 Immunophilin FKBP12 PPIase FKBP1A Rotamase mTOR/FKBP12A/FKBP12B
Type:
Isomerase
Mol. Mass.:
11953.09
Organism:
Homo sapiens (Human)
Description:
P62942
Residue:
108
  
Inhibitor
Name:
BDBM50064353
Synonyms:
CHEMBL51516 | {4-[2-(17-Ethyl-1,14-dihydroxy-23,25-dimethoxy-13,19,21,27-tetramethyl-2,3,10,16-tetraoxo-11,28-dioxa-4-aza-tricyclo[22.3.1.0*4,9*]octacos-18-en-12-yl)-propenyl]-2-methoxy-cyclohexyloxy}-acetic acid
Type:
Small organic molecule
Emp. Form.:
C45H71NO14
Mol. Mass.:
850.0435
SMILES:
CC[C@@H]1\C=C(C)\C[C@H](C)C[C@H](OC)[C@H]2O[C@](O)([C@H](C)C[C@@H]2OC)C(=O)C(=O)N2CCCC[C@H]2C(=O)O[C@@H]([C@H](C)[C@@H](O)CC1=O)C(\C)=C\C1CC[C@@H](OCC(O)=O)[C@@H](C1)OC
: