Target
Beta-lactamase
Ligand
BDBM50021959
Substrate
Meas. Tech.
ChEMBL_40704 (CHEMBL654916)
IC50
15±n/a nM
Citation
 Heinze-Krauss, IAngehrn, PCharnas, RLGubernator, KGutknecht, EMHubschwerlen, CKania, MOefner, CPage, MGSogabe, SSpecklin, JLWinkler, F Structure-based design of beta-lactamase inhibitors. 1. Synthesis and evaluation of bridged monobactams. J Med Chem 41:3961-71 (1998)  
Target
Name:
Beta-lactamase
Synonyms:
AMPC_ECOLI Beta-lactamase (AmpC) Cephalosporinase ampA | ampC
Type:
Protien
Mol. Mass.:
41561.62
Organism:
Escherichia coli
Description:
P00811
Residue:
377
  
Inhibitor
Name:
BDBM50021959
Synonyms:
CHEMBL777 US9120808, Clavulanic acid potassium salt clavulanic acid
Type:
Small organic molecule
Emp. Form.:
C8H9NO5
Mol. Mass.:
199.1608
SMILES:
OC\C=C1/O[C@@H]2CC(=O)N2[C@H]1C(O)=O
: