Target
Voltage-dependent L-type calcium channel subunit alpha-1C
Ligand
BDBM50067635
Substrate
Meas. Tech.
ChEMBL_177783 (CHEMBL785241)
IC50
840.0±n/a nM
Citation
 Kato, TOzaki, TTamura, KSuzuki, YAkima, MOhi, N Novel calcium antagonists with both calcium overload inhibition and antioxidant activity. 1. 2-(3, 5-di-tert-butyl-4-hydroxyphenyl)-3-(aminopropyl)thiazolidinones. J Med Chem 41:4309-16 (1998)  
Target
Name:
Voltage-dependent L-type calcium channel subunit alpha-1C
Synonyms:
CAC1C_RAT Cacn2 Cacnl1a1 Calcium channel (Type L) Calcium channel, L type, alpha-1 polypeptide, isoform 1, cardiac muscle RBC Voltage-dependent L-type calcium channel subunit alpha-1C Voltage-gated L-type calcium channel alpha-1C subunit | Voltage-gated calcium channel subunit alpha Cav1.2
Type:
Enzyme Catalytic Domain
Mol. Mass.:
243492.26
Organism:
RAT
Description:
Calcium channel 0 RAT::P22002
Residue:
2169
  
Inhibitor
Name:
BDBM50067635
Synonyms:
2-(3,5-Di-tert-butyl-4-hydroxy-phenyl)-3-{3-[(2-ethoxy-ethyl)-methyl-amino]-propyl}-thiazolidin-4-one | CHEMBL341710
Type:
Small organic molecule
Emp. Form.:
C25H42N2O3S
Mol. Mass.:
450.678
SMILES:
CCOCCN(C)CCCN1C(SCC1=O)c1cc(c(O)c(c1)C(C)(C)C)C(C)(C)C
: