Target
M-phase inducer phosphatase 1
Ligand
BDBM50068031
Substrate
Meas. Tech.
ChEMBL_40087 (CHEMBL655756)
IC50
2200±n/a nM
Citation
 Peng, HZalkow, LHAbraham, RTPowis, G Novel CDC25A phosphatase inhibitors from pyrolysis of 3-alpha-azido-B-homo-6-oxa-4-cholesten-7-one on silica gel. J Med Chem 41:4677-80 (1998)  
Target
Name:
M-phase inducer phosphatase 1
Synonyms:
CDC25A Dual specificity phosphatase Cdc25A MPIP1_HUMAN | phosphatase Cdc25
Type:
Protein
Mol. Mass.:
59090.18
Organism:
Homo sapiens (Human)
Description:
P30304
Residue:
524
  
Inhibitor
Name:
BDBM50068031
Synonyms:
CHEMBL142455 [5-(5-Cyano-1-methylene-pentyl)-1-(1,5-dimethyl-hexyl)-7a-methyl-octahydro-inden-4-yl]-acetic acid | [5-(5-Cyano-1-methylene-pentyl)-1-(1,5-dimethyl-hexyl)-7a-methyl-octahydro-inden-4-yl]-acetic acid(HP-19)
Type:
Small organic molecule
Emp. Form.:
C27H45NO2
Mol. Mass.:
415.6517
SMILES:
CC(C)CCC[C@@H](C)[C@H]1CC[C@H]2[C@H](CC(O)=O)[C@H](CC[C@]12C)C(=C)CCCCC#N
: