Target
Interstitial collagenase
Ligand
BDBM50031795
Substrate
Meas. Tech.
ChEBML_70456
IC50
60±n/a nM
Citation
 Bailey, SBolognese, BBuckle, DRFaller, AJackson, SLouis-Flamberg, PMcCord, MMayer, RJMarshall, LASmith, DG Selective inhibition of low affinity IgE receptor (CD23) processing. Bioorg Med Chem Lett 8:29-34 (1999)  
Target
Name:
Interstitial collagenase
Synonyms:
CLG MMP1 Matrix metalloproteinase-1 | Matrix metalloproteinase-1 (MMP-1)
Type:
Enzyme
Mol. Mass.:
54010.26
Organism:
Homo sapiens (Human)
Description:
P03956
Residue:
469
  
Inhibitor
Name:
BDBM50031795
Synonyms:
(N-(2-HYDROXAMATEMETHYLENE-4-METHYL-PENTOYL)PHENYLALANYL)METHYL AMINE (R)-N4-hydroxy-2-isobutyl-N1-((S)-1-(methylamino)-1-oxo-3-phenylpropan-2-yl)succinamide METHYLAMINO-PHENYLALANYL-LEUCYL-HYDROXAMIC ACID
Type:
Small organic molecule
Emp. Form.:
C18H27N3O4
Mol. Mass.:
349.4247
SMILES:
CNC(=O)[C@H](Cc1ccccc1)NC(=O)[C@H](CC(C)C)CC(=O)NO
: