Target
Matrix metalloproteinase-9
Ligand
BDBM50070226
Substrate
Meas. Tech.
ChEBML_105234
IC50
4±n/a nM
Citation
 Campbell, DAXiao, XYHarris, DIda, SMortezaei, RNgu, KShi, LTien, DWang, YNavre, MPatel, DVSharr, MADiJoseph, JFKillar, LMLeone, CLLevin, JISkotnicki, JS Malonyl alpha-mercaptoketones and alpha-mercaptoalcohols, a new class of matrix metalloproteinase inhibitors. Bioorg Med Chem Lett 8:1157-62 (1999)  
Target
Name:
Matrix metalloproteinase-9
Synonyms:
67 kDa matrix metalloproteinase-9 92 kDa gelatinase CLG4B Gelatinase B MMP9 Matrix metalloproteinase 9 (MMP-9) Matrix metalloproteinase-9 (MMP9)
Type:
Enzyme
Mol. Mass.:
78452.28
Organism:
Homo sapiens (Human)
Description:
P14780
Residue:
707
  
Inhibitor
Name:
BDBM50070226
Synonyms:
2-(2-Mercapto-acetyl)-nonanoic acid {(S)-2-cyclohexyl-1-[2-(4-sulfamoyl-phenyl)-ethylcarbamoyl]-ethyl}-amide | CHEMBL15964
Type:
Small organic molecule
Emp. Form.:
C28H45N3O5S2
Mol. Mass.:
567.804
SMILES:
CCCCCCCC(C(=O)CS)C(=O)N[C@@H](CC1CCCCC1)C(=O)NCCc1ccc(cc1)S(N)(=O)=O
: