Target
Corticotropin-releasing factor receptor 1
Ligand
BDBM50074468
Substrate
Meas. Tech.
ChEMBL_51114 (CHEMBL664960)
Ki
2.2±n/a nM
Citation
 Chorvat, RJBakthavatchalam, RBeck, JPGilligan, PJWilde, RGCocuzza, AJHobbs, FWCheeseman, RSCurry, MRescinito, JPKrenitsky, PChidester, DYarem, JAKlaczkiewicz, JDHodge, CNAldrich, PEWasserman, ZRFernandez, CHZaczek, RFitzgerald, LWHuang, SMShen, HLWong, YNChien, BMArvanitis, A Synthesis, corticotropin-releasing factor receptor binding affinity, and pharmacokinetic properties of triazolo-, imidazo-, and pyrrolopyrimidines and -pyridines. J Med Chem 42:833-48 (1999)  
Target
Name:
Corticotropin-releasing factor receptor 1
Synonyms:
CRF-R CRF1 CRFR1 CRH-R 1 CRHR1 Corticotropin-releasing factor receptor 1 (CRF-1) Corticotropin-releasing hormone receptor 1
Type:
Enzyme
Mol. Mass.:
50744.31
Organism:
Homo sapiens (Human)
Description:
P34998
Residue:
444
  
Inhibitor
Name:
BDBM50074468
Synonyms:
Butyl-ethyl-[3-(4-isopropyl-2-methylsulfanyl-phenyl)-5-methyl-3H-[1,2,3]triazolo[4,5-b]pyridin-7-yl]-amine | CHEMBL169010
Type:
Small organic molecule
Emp. Form.:
C22H31N5S
Mol. Mass.:
397.58
SMILES:
CCCCN(CC)c1cc(C)nc2n(nnc12)-c1ccc(cc1SC)C(C)C
: