Target
Integrin alpha-4/beta-1
Ligand
BDBM50074668
Substrate
Meas. Tech.
ChEMBL_217445 (CHEMBL823344)
IC50
18±n/a nM
Citation
 Lin, KAteeq, HSHsiung, SHChong, LTZimmerman, CNCastro, ALee, WCHammond, CEKalkunte, SChen, LLPepinsky, RBLeone, DRSprague, AGAbraham, WMGill, ALobb, RRAdams, SP Selective, tight-binding inhibitors of integrin alpha4beta1 that inhibit allergic airway responses. J Med Chem 42:920-34 (1999)  
Target
Name:
Integrin alpha-4/beta-1
Synonyms:
Fibronectin receptor beta/Integrin alpha-4 | Integrin alpha-4/beta-1
Type:
Mol. Mass.:
Description:
ASSAY_ID of EBI is 88912
Components:
This complex has 2 components.
Component 1
Name:
Integrin beta-1
Synonyms:
CD_antigen=CD29 Fibronectin receptor beta GPIIA ITGB1 MDF2 | MSK12
Type:
Enzyme
Mol. Mass.:
88400.38
Organism:
Homo sapiens (Human)
Description:
P05556
Residue:
798
  
Component 2
Name:
Integrin alpha-4
Synonyms:
CD49 antigen-like family member D CD49d antigen ITA4_HUMAN Integrin alpha-4 Integrin alpha-IV VLA-4 integrin alpha 4 precursor | integrin alpha-4 precursor
Type:
Membrane Protein
Mol. Mass.:
114897.35
Organism:
Homo sapiens (Human)
Description:
P13612
Residue:
1032
  
Inhibitor
Name:
BDBM50074668
Synonyms:
(S)-2-((S)-4-Methyl-2-{2-[4-(3-o-tolyl-ureido)-phenyl]-acetylamino}-pentanoylamino)-succinic acid | CHEMBL173552
Type:
Small organic molecule
Emp. Form.:
C26H32N4O7
Mol. Mass.:
512.5549
SMILES:
CC(C)C[C@H](NC(=O)Cc1ccc(NC(=O)Nc2ccccc2C)cc1)C(=O)N[C@@H](CC(O)=O)C(O)=O
: