Target
RAF proto-oncogene serine/threonine-protein kinase
Ligand
BDBM50077975
Substrate
Meas. Tech.
ChEMBL_216840 (CHEMBL820579)
IC50
3500±n/a nM
Citation
 Liverton, NJButcher, JWClaiborne, CFClaremon, DALibby, BENguyen, KTPitzenberger, SMSelnick, HGSmith, GRTebben, AVacca, JPVarga, SLAgarwal, LDancheck, KForsyth, AJFletcher, DSFrantz, BHanlon, WAHarper, CFHofsess, SJKostura, MLin, JLuell, SO'Neill, EAO'Keefe, SJ Design and synthesis of potent, selective, and orally bioavailable tetrasubstituted imidazole inhibitors of p38 mitogen-activated protein kinase. J Med Chem 42:2180-90 (1999)  
Target
Name:
RAF proto-oncogene serine/threonine-protein kinase
Synonyms:
C-Raf Protein Kinase RAF RAF1 Raf-1 Serine/threonine-protein kinase C-Raf | cRaf
Type:
Serine/threonine-protein kinase
Mol. Mass.:
73082.52
Organism:
Homo sapiens (Human)
Description:
P04049
Residue:
648
  
Inhibitor
Name:
BDBM50077975
Synonyms:
((S)-1-Phenyl-ethyl)-{4-[2-piperidin-4-yl-5-(3-trifluoromethyl-phenyl)-3H-imidazol-4-yl]-pyrimidin-2-yl}-amine | CHEMBL308939
Type:
Small organic molecule
Emp. Form.:
C27H27F3N6
Mol. Mass.:
492.5387
SMILES:
C[C@H](Nc1nccc(n1)-c1nc([nH]c1-c1cccc(c1)C(F)(F)F)C1CCNCC1)c1ccccc1
: