Target
Voltage-dependent N-type calcium channel subunit alpha-1B
Ligand
BDBM50078730
Substrate
Meas. Tech.
ChEBML_141444
IC50
90±n/a nM
Citation
 Ryder, TRHu, LYRafferty, MFMillerman, ESzoke, BGTarczy-Hornoch, K Multiple parallel synthesis of N,N-dialkyldipeptidylamines as N-type calcium channel blockers. Bioorg Med Chem Lett 9:1813-8 (1999)  
Target
Name:
Voltage-dependent N-type calcium channel subunit alpha-1B
Synonyms:
BIII CAC1B_HUMAN CACNA1B Calcium channel (Type N) Voltage-dependent N-type calcium channel subunit alpha-1B Voltage-gated N-type calcium channel alpha-1B subunit Voltage-gated calcium channel Voltage-gated calcium channel subunit alpha Cav2.2 ((alpha 1B, beta 1b, alpha 2 delta-1) | calcium channel, voltage-dependent, N type, alpha 1B subunit
Type:
Enzyme
Mol. Mass.:
262548.16
Organism:
Homo sapiens (Human)
Description:
Q00975
Residue:
2339
  
Inhibitor
Name:
BDBM50078730
Synonyms:
(S)-2-[(4-tert-Butyl-benzyl)-methyl-amino]-4-methyl-pentanoic acid [(S)-1-(4-benzyloxy-benzyl)-2-oxo-2-piperidin-1-yl-ethyl]-amide | CHEMBL300261
Type:
Small organic molecule
Emp. Form.:
C39H53N3O3
Mol. Mass.:
611.8564
SMILES:
CC(C)C[C@H](N(C)Cc1ccc(cc1)C(C)(C)C)C(=O)N[C@@H](Cc1ccc(OCc2ccccc2)cc1)C(=O)N1CCCCC1
: