Target
Adenosine receptor A1
Ligand
BDBM50080288
Substrate
Meas. Tech.
ChEMBL_27911 (CHEMBL642159)
Ki
12±n/a nM
Citation
 Campbell, RMCartwright, CChen, WChen, YDuzic, EFu, JMLoveland, MManning, RMcKibben, BPleiman, CMSilverman, LTrueheart, JWebb, DRWilkinson, VWitter, DJXie, XCastelhano, AL Selective A1-adenosine receptor antagonists identified using yeast Saccharomyces cerevisiae functional assays. Bioorg Med Chem Lett 9:2413-8 (1999)  
Target
Name:
Adenosine receptor A1
Synonyms:
A1 adenosine receptor (hA1) AA1R_HUMAN ADORA1 Adenosine A1-receptor Adenosine receptor A1 (hA1) | Adenosine transporter (AdT)
Type:
G Protein-Coupled Receptor (GPCR)
Mol. Mass.:
36520.92
Organism:
Homo sapiens (Human)
Description:
P30542
Residue:
326
  
Inhibitor
Name:
BDBM50080288
Synonyms:
CHEMBL81616 | N-[2-(5,6-Dimethyl-2-phenyl-7H-pyrrolo[2,3-d]pyrimidin-4-ylamino)-ethyl]-acetamide
Type:
Small organic molecule
Emp. Form.:
C18H21N5O
Mol. Mass.:
323.3922
SMILES:
CC(=O)NCCNc1nc(nc2[nH]c(C)c(C)c12)-c1ccccc1
: