Target
Neuronal acetylcholine receptor subunit alpha-7
Ligand
BDBM82070
Substrate
Meas. Tech.
ChEBML_144339
IC50
16±n/a nM
Citation
 Choi, KICha, JHCho, YSPae, ANJin, CYook, JCheon, HGJeong, DKong, JYKoh, HY Binding affinities of 3-(3-phenylisoxazol-5-yl)methylidene-1-azabicycles to acetylcholine receptors. Bioorg Med Chem Lett 9:2795-800 (1999)  
Target
Name:
Neuronal acetylcholine receptor subunit alpha-7
Synonyms:
ACHA7_RAT Cholinergic, Nicotinic Alpha7 Chrna7 Neuronal acetylcholine receptor (alpha7 nAChR) Neuronal acetylcholine receptor subunit alpha-7 Neuronal acetylcholine receptor subunit alpha-7 (nAChR)
Type:
Enzyme
Mol. Mass.:
56502.44
Organism:
Rattus norvegicus (Rat)
Description:
Q05941
Residue:
502
  
Inhibitor
Name:
BDBM82070
Synonyms:
CAS_29790-52-1 Nicotine-D salicylate US9303017, Nicotine
Type:
Emp. Form.:
C10H14N2
Mol. Mass.:
162.2316
SMILES:
CN1CCC[C@H]1c1cccnc1
: