Target
Retinoic acid receptor alpha
Ligand
BDBM31892
Substrate
Meas. Tech.
ChEMBL_196657 (CHEMBL800770)
EC50
102±n/a nM
Citation
 Simoni, DInvidiata, FPRondanin, RGrimaudo, SCannizzo, GBarbusca, EPorretto, FD'Alessandro, NTolomeo, M Structure-activity relationship studies of novel heteroretinoids: induction of apoptosis in the HL-60 cell line by a novel isoxazole-containing heteroretinoid. J Med Chem 42:4961-9 (2000)  
Target
Name:
Retinoic acid receptor alpha
Synonyms:
NR1B1 RAR-alpha RARA_HUMAN Retinoic acid receptor alpha/Retinoid X receptor alpha Retinoid receptor
Type:
PROTEIN
Mol. Mass.:
50778.87
Organism:
Homo sapiens (Human)
Description:
ChEMBL_1466191
Residue:
462
  
Inhibitor
Name:
BDBM31892
Synonyms:
9-cis retinoic acid CHEMBL705 alitretinoin
Type:
Small organic molecule
Emp. Form.:
C20H28O2
Mol. Mass.:
300.4351
SMILES:
C\C(\C=C\C1=C(C)CCCC1(C)C)=C\C=C\C(\C)=C\C(O)=O
: