Target
Platelet-activating factor acetylhydrolase
Ligand
BDBM50085638
Substrate
Meas. Tech.
ChEBML_156217
IC50
4400±n/a nM
Citation
 Boyd, HFFlynn, STHickey, DMIfe, RJJones, MLeach, CAMacphee, CHMilliner, KJRawlings, DASlingsby, BPSmith, SAStansfield, IGTew, DGTheobald, CJ 2-(Alkylthio)pyrimidin-4-ones as novel, reversible inhibitors of lipoprotein-associated phospholipase A2. Bioorg Med Chem Lett 10:395-8 (2000)  
Target
Name:
Platelet-activating factor acetylhydrolase
Synonyms:
1-alkyl-2-acetylglycerophosphocholine esterase LDL-PLA(2) PAF 2-acylhydrolase PAFAH PLA2G7 | Platelet-activating factor acetylhydrolase
Type:
PROTEIN
Mol. Mass.:
50084.41
Organism:
Homo sapiens (Human)
Description:
ChEMBL_156212
Residue:
441
  
Inhibitor
Name:
BDBM50085638
Synonyms:
2-(4-Chloro-benzylsulfanyl)-5-pyridin-3-ylmethyl-1H-pyrimidin-4-one | CHEMBL335443
Type:
Small organic molecule
Emp. Form.:
C17H14ClN3OS
Mol. Mass.:
343.831
SMILES:
Clc1ccc(CSc2ncc(Cc3cccnc3)c(=O)[nH]2)cc1
: