Target
Peptidyl-prolyl cis-trans isomerase FKBP1A
Ligand
BDBM50086094
Substrate
Meas. Tech.
ChEMBL_138591 (CHEMBL746519)
IC50
3.8±n/a nM
Citation
 Yang, WRozamus, LWNarula, SRollins, CTYuan, RAndrade, LJRam, MKPhillips, TBvan Schravendijk, MRDalgarno, DClackson, THolt, DA Investigating protein-ligand interactions with a mutant FKBP possessing a designed specificity pocket. J Med Chem 43:1135-42 (2000)  
Target
Name:
Peptidyl-prolyl cis-trans isomerase FKBP1A
Synonyms:
12 kDa FK506-binding protein FK506-binding protein 1A FKB1A_HUMAN FKBP-1A FKBP12 Immunophilin FKBP12 PPIase FKBP1A Rotamase mTOR/FKBP12A/FKBP12B
Type:
Isomerase
Mol. Mass.:
11953.09
Organism:
Homo sapiens (Human)
Description:
P62942
Residue:
108
  
Inhibitor
Name:
BDBM50086094
Synonyms:
1-[2-(3,4,5-Trimethoxy-phenyl)-pentanoyl]-piperidine-2-carboxylic acid 1-(3-carboxymethoxy-phenyl)-3-(3,4-dimethoxy-phenyl)-propyl ester | CHEMBL266848
Type:
Small organic molecule
Emp. Form.:
C39H49NO11
Mol. Mass.:
707.8065
SMILES:
CCC[C@H](C(=O)N1CCCC[C@H]1C(=O)OC(CCc1ccc(OC)c(OC)c1)c1cccc(OCC(O)=O)c1)c1cc(OC)c(OC)c(OC)c1
: