Target
Substance-P receptor
Ligand
BDBM50220136
Substrate
Meas. Tech.
ChEMBL_205742 (CHEMBL814181)
IC50
0.09±n/a nM
Citation
 Hale, JJMills, SGMacCoss, MDorn, CPFinke, PEBudhu, RJReamer, RAHuskey, SELuffer-Atlas, DDean, BJMcGowan, EMFeeney, WPChiu, SHCascieri, MAChicchi, GGKurtz, MMSadowski, SBer, ETattersall, FDRupniak, NMWilliams, ARRycroft, WHargreaves, RMetzger, JMMacIntyre, DE Phosphorylated morpholine acetal human neurokinin-1 receptor antagonists as water-soluble prodrugs. J Med Chem 43:1234-41 (2000)  
Target
Name:
Substance-P receptor
Synonyms:
NK-1 receptor NK1 Receptor NK1R_HUMAN Neurokinin-1 (NK-1) SPR TACR1 Tachykinin receptor 1 (NK1) | tachykinin
Type:
G Protein-Coupled Receptor (GPCR)
Mol. Mass.:
46254.43
Organism:
Homo sapiens (Human)
Description:
P25103
Residue:
407
  
Inhibitor
Name:
BDBM50220136
Synonyms:
3-[2-{1-[3,5-di(trifluoromethyl)phenyl]ethoxy}-3-(4-fluorophenyl)-1,4-oxazinan-4-ylmethyl]-4,5-dihydro-1H-1,2,4-triazol-5-one 5-[(2R,3S)-2-[(R)-1-(3,5-Bis-trifluoromethyl-phenyl)-ethoxy]-3-(4-fluoro-phenyl)-morpholin-4-ylmethyl]-2,4-dihydro-[1,2,4]triazol-3-one APREPITANT Emend MK-869 US10100030, Aprepitant
Type:
Small organic molecule
Emp. Form.:
C23H21F7N4O3
Mol. Mass.:
534.4267
SMILES:
C[C@@H](O[C@H]1OCCN(Cc2n[nH]c(=O)[nH]2)[C@H]1c1ccc(F)cc1)c1cc(cc(c1)C(F)(F)F)C(F)(F)F
: