Target
Mitogen-activated protein kinase 14
Ligand
BDBM50089122
Substrate
Meas. Tech.
ChEBML_221156
IC50
76±n/a nM
Citation
 Revesz, LDi Padova, FEBuhl, TFeifel, RGram, HHiestand, PManning, UZimmerlin, AG SAR of 4-hydroxypiperidine and hydroxyalkyl substituted heterocycles as novel p38 map kinase inhibitors. Bioorg Med Chem Lett 10:1261-4 (2000)  
Target
Name:
Mitogen-activated protein kinase 14
Synonyms:
Crk1 Csbp2 MAP kinase p38 Mapk14 Mitogen-activated protein kinase p38 alpha
Type:
Enzyme
Mol. Mass.:
41281.22
Organism:
Mus musculus (mouse)
Description:
The full-length open reading frame of murine p38 alpha was cloned and expressed in E. coli.. Soluble murine p38R was extracted from cell pellets and purified using ion-exchange chromatography.
Residue:
360
  
Inhibitor
Name:
BDBM50089122
Synonyms:
1-[5-(4-Fluoro-phenyl)-4-pyridin-4-yl-1H-imidazol-2-yl]-cycloheptanol | CHEMBL277409
Type:
Small organic molecule
Emp. Form.:
C21H22FN3O
Mol. Mass.:
351.4173
SMILES:
OC1(CCCCCC1)c1nc(c([nH]1)-c1ccc(F)cc1)-c1ccncc1
: