Target
Stromelysin-1
Ligand
BDBM50074027
Substrate
Meas. Tech.
ChEMBL_104880 (CHEMBL709178)
Ki
700±n/a nM
Citation
 Salvino, JMMathew, RKiesow, TNarensingh, RMason, HJDodd, AGroneberg, RBurns, CJMcGeehan, GKline, JOrton, ETang, SYMorrisette, MLabaudininiere, R Solid-phase synthesis of an arylsulfone hydroxamate library. Bioorg Med Chem Lett 10:1637-40 (2000)  
Target
Name:
Stromelysin-1
Synonyms:
MMP-3 MMP3_HUMAN Matrix metalloproteinase 3 Matrix metalloproteinase-3 (MMP-3) SL-1 Stromelysin 1 | Transin-1
Type:
Enzyme
Mol. Mass.:
53973.13
Organism:
Homo sapiens (Human)
Description:
P08254
Residue:
477
  
Inhibitor
Name:
BDBM50074027
Synonyms:
3-(4-Methoxy-benzenesulfonyl)-7-phenyl-heptanoic acid hydroxyamide | CHEMBL44250
Type:
Small organic molecule
Emp. Form.:
C20H25NO5S
Mol. Mass.:
391.481
SMILES:
COc1ccc(cc1)S(=O)(=O)C(CCCCc1ccccc1)CC(=O)NO
: