Target
Integrin alpha-IIb/beta-3
Ligand
BDBM50004058
Substrate
Meas. Tech.
ChEMBL_218217 (CHEMBL824387)
Kd
13±n/a nM
Citation
 Egbertson, MSBednar, BAskew, BCBednar, RABrashear, KBreslin, MJDuggan, MEFisher, TEHalczenko, WHutchinson, JHIhle, NPrugh, JDWai, JSGould, RJHartman, GD Nonpeptide GPIIB/IIIA receptor antagonists. Part 21: C-6 flexibility and amide bond orientation are important factors in determining the affinity of compounds for activated or resting platelet receptors. Bioorg Med Chem Lett 10:1943-8 (2001)  
Target
Name:
Integrin alpha-IIb/beta-3
Synonyms:
Glycoprotein IIb/IIIa
Type:
Mol. Mass.:
Description:
ASSAY_ID of EBI is 30109
Components:
This complex has 2 components.
Component 1
Name:
Integrin beta-3
Synonyms:
CD_antigen=CD61 GPIIIa ITGB3 Platelet membrane glycoprotein IIIa
Type:
Protein
Mol. Mass.:
87038.91
Organism:
Homo sapiens (Human)
Description:
P05106
Residue:
788
  
Component 2
Name:
Integrin alpha-IIb
Synonyms:
CD_antigen=CD41 GPIIb Glycoprotein IIb ITGA2B Integrin alpha-IIb heavy chain Integrin alpha-IIb light chain, form 2 Integrin alpha-V/beta-3 and alpha-IIb/beta 3 | Platelet membrane glycoprotein IIb
Type:
Protein
Mol. Mass.:
113354.85
Organism:
Homo sapiens (Human)
Description:
P08514
Residue:
1039
  
Inhibitor
Name:
BDBM50004058
Synonyms:
(2S)-2-(butylsulfonylamino)-3-[4-(4-piperidin-4-ylbutoxy)phenyl]propanoic acid N-(butylsulfonyl)-O-(4-piperidin-4-ylbutyl)-L-tyrosine | tirofiban
Type:
Small organic molecule
Emp. Form.:
C22H36N2O5S
Mol. Mass.:
440.597
SMILES:
CCCCS(=O)(=O)N[C@@H](Cc1ccc(OCCCCC2CCNCC2)cc1)C(O)=O
: