Target
Integrin alpha-IIb/beta-3
Ligand
BDBM50091733
Substrate
Meas. Tech.
ChEMBL_218219 (CHEMBL821404)
Kd
0.056000±n/a nM
Citation
 Egbertson, MSBednar, BAskew, BCBednar, RABrashear, KBreslin, MJDuggan, MEFisher, TEHalczenko, WHutchinson, JHIhle, NPrugh, JDWai, JSGould, RJHartman, GD Nonpeptide GPIIB/IIIA receptor antagonists. Part 21: C-6 flexibility and amide bond orientation are important factors in determining the affinity of compounds for activated or resting platelet receptors. Bioorg Med Chem Lett 10:1943-8 (2001)  
Target
Name:
Integrin alpha-IIb/beta-3
Synonyms:
Glycoprotein IIb/IIIa
Type:
Mol. Mass.:
Description:
ASSAY_ID of EBI is 30109
Components:
This complex has 2 components.
Component 1
Name:
Integrin beta-3
Synonyms:
CD_antigen=CD61 GPIIIa ITGB3 Platelet membrane glycoprotein IIIa
Type:
Protein
Mol. Mass.:
87038.91
Organism:
Homo sapiens (Human)
Description:
P05106
Residue:
788
  
Component 2
Name:
Integrin alpha-IIb
Synonyms:
CD_antigen=CD41 GPIIb Glycoprotein IIb ITGA2B Integrin alpha-IIb heavy chain Integrin alpha-IIb light chain, form 2 Integrin alpha-V/beta-3 and alpha-IIb/beta 3 | Platelet membrane glycoprotein IIb
Type:
Protein
Mol. Mass.:
113354.85
Organism:
Homo sapiens (Human)
Description:
P08514
Residue:
1039
  
Inhibitor
Name:
BDBM50091733
Synonyms:
(S)-2-Benzenesulfonylamino-3-{[5-(2-piperidin-4-yl-ethoxy)-1H-indole-2-carbonyl]-amino}-propionic acid | CHEMBL57040
Type:
Small organic molecule
Emp. Form.:
C25H30N4O6S
Mol. Mass.:
514.594
SMILES:
OC(=O)[C@H](CNC(=O)c1cc2cc(OCCC3CCNCC3)ccc2[nH]1)NS(=O)(=O)c1ccccc1
: