Target
Adenosine receptor A2a
Ligand
BDBM50095784
Substrate
Meas. Tech.
ChEMBL_31349 (CHEMBL641570)
Ki
13±n/a nM
Citation
 Harada, HAsano, OHoshino, YYoshikawa, SMatsukura, MKabasawa, YNiijima, JKotake, YWatanabe, NKawata, TInoue, THorizoe, TYasuda, NMinami, HNagata, KMurakami, MNagaoka, JKobayashi, STanaka, IAbe, S 2-Alkynyl-8-aryl-9-methyladenines as novel adenosine receptor antagonists: their synthesis and structure-activity relationships toward hepatic glucose production induced via agonism of the A(2B) receptor. J Med Chem 44:170-9 (2001)  
Target
Name:
Adenosine receptor A2a
Synonyms:
A2A adenosine receptor (hA2A) ADENOSINE A2 ADORA2 Adenosine A2A receptor (A2AAR)
Type:
G Protein-Coupled Receptor (GPCR)
Mol. Mass.:
44716.46
Organism:
Homo sapiens (Human)
Description:
P29274
Residue:
412
  
Inhibitor
Name:
BDBM50095784
Synonyms:
1-[6-Amino-8-(3-fluoro-phenyl)-9-methyl-9H-purin-2-yl]-3-ethyl-pent-1-yn-3-ol | CHEMBL51192
Type:
Small organic molecule
Emp. Form.:
C19H20FN5O
Mol. Mass.:
353.3934
SMILES:
CCC(O)(CC)C#Cc1nc(N)c2nc(-c3cccc(F)c3)n(C)c2n1
: