Target
Corticotropin-releasing factor receptor 1
Ligand
BDBM50096722
Substrate
Meas. Tech.
ChEBML_51283
Ki
14±n/a nM
Citation
 Tian, XHsin, LWWebster, ELContoreggi, CChrousos, GPGold, PWHabib, KAyala, AEckelman, WCJacobson, AERice, KC The development of a potential single photon emission computed tomography (SPECT) imaging agent for the corticotropin-releasing hormone receptor type. Bioorg Med Chem Lett 11:331-3 (2001)  
Target
Name:
Corticotropin-releasing factor receptor 1
Synonyms:
CRF-R CRFR1_RAT Corticotropin releasing factor receptor Corticotropin-releasing Factor Receptor 1 Crhr | Crhr1
Type:
G Protein-Coupled Receptor (GPCR)
Mol. Mass.:
47870.75
Organism:
Rattus norvegicus (rat)
Description:
Receptor binding assays were performed using rat cortex homogenate.
Residue:
415
  
Inhibitor
Name:
BDBM50096722
Synonyms:
5-Chloro-N-cyclopropylmethyl-N'-(2,6-dichloro-4-iodo-phenyl)-2-methyl-N-propyl-pyrimidine-4,6-diamine | CHEMBL325577
Type:
Small organic molecule
Emp. Form.:
C18H20Cl3IN4
Mol. Mass.:
525.642
SMILES:
CCCN(CC1CC1)c1nc(C)nc(Nc2c(Cl)cc(I)cc2Cl)c1Cl
: