Target
Vascular cell adhesion protein 1
Ligand
BDBM50098518
Substrate
Meas. Tech.
ChEMBL_213817 (CHEMBL815900)
IC50
2100±n/a nM
Citation
 Stewart, AOBhatia, PAMcCarty, CMPatel, MVStaeger, MAArendsen, DLGunawardana, IWMelcher, LMZhu, GDBoyd, SAFry, DGCool, BLKifle, LLartey, KMarsh, KCKempf-Grote, AJKilgannon, PWisdom, WMeyer, JGallatin, WMOkasinski, GF Discovery of inhibitors of cell adhesion molecule expression in human endothelial cells. 1. Selective inhibition of ICAM-1 and E-selectin expression. J Med Chem 44:988-1002 (2001)  
Target
Name:
Vascular cell adhesion protein 1
Synonyms:
CD106 antigen VCAM-1 VCAM1_HUMAN Vascular cell adhesion protein 1 (VCAM-1) | Vascular cell adhesion protein 1 precursor
Type:
Other Protein Type
Mol. Mass.:
81259.16
Organism:
Homo sapiens (Human)
Description:
P19320
Residue:
739
  
Inhibitor
Name:
BDBM50098518
Synonyms:
4-p-Tolylsulfanyl-thieno[2,3-c]pyridine | CHEMBL266572
Type:
Small organic molecule
Emp. Form.:
C14H11NS2
Mol. Mass.:
257.374
SMILES:
Cc1ccc(Sc2cncc3sccc23)cc1
: