Target
E-selectin
Ligand
BDBM50098506
Substrate
Meas. Tech.
ChEMBL_199704 (CHEMBL803587)
IC50
12±n/a nM
Citation
 Stewart, AOBhatia, PAMcCarty, CMPatel, MVStaeger, MAArendsen, DLGunawardana, IWMelcher, LMZhu, GDBoyd, SAFry, DGCool, BLKifle, LLartey, KMarsh, KCKempf-Grote, AJKilgannon, PWisdom, WMeyer, JGallatin, WMOkasinski, GF Discovery of inhibitors of cell adhesion molecule expression in human endothelial cells. 1. Selective inhibition of ICAM-1 and E-selectin expression. J Med Chem 44:988-1002 (2001)  
Target
Name:
E-selectin
Synonyms:
ELAM1 SELE Selectin E
Type:
PROTEIN
Mol. Mass.:
66642.96
Organism:
Homo sapiens (Human)
Description:
ChEMBL_1438995
Residue:
610
  
Inhibitor
Name:
BDBM50098506
Synonyms:
4-(4-Chloro-phenylsulfanyl)-thieno[2,3-c]pyridine-2-carboxylic acid amide | CHEMBL268567
Type:
Small organic molecule
Emp. Form.:
C14H9ClN2OS2
Mol. Mass.:
320.817
SMILES:
NC(=O)c1cc2c(Sc3ccc(Cl)cc3)cncc2s1
: