Target
Suppressor of tumorigenicity 14 protein
Ligand
BDBM50098556
Substrate
Meas. Tech.
ChEMBL_105806 (CHEMBL718140)
Ki
>10000±n/a nM
Citation
 Enyedy, IJLee, SLKuo, AHDickson, RBLin, CYWang, S Structure-based approach for the discovery of bis-benzamidines as novel inhibitors of matriptase. J Med Chem 44:1349-55 (2001)  
Target
Name:
Suppressor of tumorigenicity 14 protein
Synonyms:
Epithin MT-SP1 PRSS14 SNC19 ST14_HUMAN Suppressor of tumorigenicity 14 protein TADG15
Type:
Single-pass type II membrane protein
Mol. Mass.:
94769.23
Organism:
Homo sapiens (Human)
Description:
Q9Y5Y6
Residue:
855
  
Inhibitor
Name:
BDBM50098556
Synonyms:
4-(2-{4-[amino(imino)methyl]phenyl}ethyl)benzenecarboximidamide | CHEMBL285114
Type:
Small organic molecule
Emp. Form.:
C16H18N4
Mol. Mass.:
266.3409
SMILES:
NC(=N)c1ccc(CCc2ccc(cc2)C(N)=N)cc1
: