Target
Carnitine O-palmitoyltransferase 1, muscle isoform
Ligand
BDBM50101598
Substrate
Meas. Tech.
ChEMBL_46323 (CHEMBL660891)
IC50
3400±n/a nM
Citation
 Giannessi, FChiodi, PMarzi, MMinetti, PPessotto, PDe Angelis, FTassoni, EConti, RGiorgi, FMabilia, MDell'Uomo, NMuck, STinti, MOCarminati, PArduini, A Reversible carnitine palmitoyltransferase inhibitors with broad chemical diversity as potential antidiabetic agents. J Med Chem 44:2383-6 (2001)  
Target
Name:
Carnitine O-palmitoyltransferase 1, muscle isoform
Synonyms:
CPT1B_RAT Cpt1b
Type:
PROTEIN
Mol. Mass.:
88241.28
Organism:
Rattus norvegicus
Description:
ChEMBL_887447
Residue:
772
  
Inhibitor
Name:
BDBM50101598
Synonyms:
CHEMBL307495 | [3-Carboxy-2-(dodecane-1-sulfonylamino)-propyl]-trimethyl-ammonium
Type:
Small organic molecule
Emp. Form.:
C19H40N2O4S
Mol. Mass.:
392.597
SMILES:
CCCCCCCCCCCCS(=O)(=O)N[C@H](CC([O-])=O)C[N+](C)(C)C
: