Target
Urokinase-type plasminogen activator
Ligand
BDBM50101866
Substrate
Meas. Tech.
ChEBML_213158
Ki
110±n/a nM
Citation
 Rai, RKolesnikov, ALi, YYoung, WBLeahy, ESprengeler, PAVerner, EShrader, WDBurgess-Henry, JSangalang, JCAllen, DChen, XKatz, BALuong, CElrod, KCregar, L Development of potent and selective factor Xa inhibitors. Bioorg Med Chem Lett 11:1797-800 (2001)  
Target
Name:
Urokinase-type plasminogen activator
Synonyms:
PLAU UROK_HUMAN Urokinase-type plasminogen activator (uPA) | Urokinase-type plasminogen activator/surface receptor
Type:
Enzyme
Mol. Mass.:
48528.62
Organism:
Homo sapiens (Human)
Description:
P00749
Residue:
431
  
Inhibitor
Name:
BDBM50101866
Synonyms:
2-(2-Hydroxy-5-methyl-biphenyl-3-yl)-1H-indole-5-carboxamidine | CHEMBL52427
Type:
Small organic molecule
Emp. Form.:
C22H19N3O
Mol. Mass.:
341.4058
SMILES:
Cc1cc(-c2cc3cc(ccc3[nH]2)C(N)=N)c(O)c(c1)-c1ccccc1
: